{"text_format":"1","workbook":"xlsx","n_sheets":7,"sheets":["DOMESTICO","DOMESTICO_NR","COMMERCIALE","ALTRI_USI","Tariffe","Fasce","Tabella_ripartizione"],"not_rendered":{"charts":0,"images":0,"macros":1,"external_links":0,"defined_names":1,"comments":0,"pivot_tables":0},"unopened":[],"bounds":{"document_bytes":16777216,"sheet_cells":100000,"rows_first":2000,"rows_last":500,"rows_between":2000,"halvings":0,"cell_chars":16384,"cell_head_chars":4096},"cells_cut":0,"cells_raw":0,"read":"whole","date_system":"1900"}

{"sheet":"DOMESTICO","index":0,"n_rows":22,"n_cols":15,"rows_kept":22,"cut":false,"hidden":false,"merged":[[9,0,9,13],[10,0,21,0],[10,1,10,2],[10,3,10,4],[10,6,10,8],[10,10,10,12]]}
["Unità domestica residente ",null,null,null,null,null,null,"Unità",1]
["Data inizio periodo consumo",null,null,null,null,{"$f":"Tabella_ripartizione!C1","v":"00:00:00"}]
["Data fine periodo consumo",null,null,null,null,{"$f":"Tabella_ripartizione!C2","v":"00:00:00"}]
["Giorni di consumo",null,null,null,null,{"$f":"+F3-F2+1","v":1}]
["Fognatura",null,null,null,null,{"$f":"Tabella_ripartizione!C4","v":1},"(0 = esente, 1=assoggettato)"]
["Depurazione",null,null,null,null,{"$f":"Tabella_ripartizione!C5","v":1},"(0 = esente, 1=assoggettato)"]
["Consumo misurato"]
["Numero di componenti nucleo familiare"]
[]
["Tariffe TICSI 2024"]
["Domestico Residente","Fasce anno (m3)",null,"Fasce pro-die (m3)",null,"mc riarticolati","Importi servizio",null,null,"Importi Quota fissa","Importi perequazione"]
[null,"da","a","da","a",{"$f":"+F17+F16+F15+F14+F13","v":{"$error":"#N/A"}},"Acqua","Fogna","Depurazione","Acqua","Acqua","Fogna","Depurazione","Totali"]
[null,0,{"$f":"VLOOKUP(F8,Fasce!A:B,2,FALSE)","v":{"$error":"#N/A"}},0,{"$f":"+ROUND(C13/365*$F$4,0)","v":{"$error":"#N/A"}},{"$f":"+IF(F7>=E13,E13,F7)","v":{"$error":"#N/A"}},{"$f":"+Tariffe!$A$3*F13","v":{"$error":"#N/A"}},{"$f":"+Tariffe!$B$3*F13*$F$5","v":{"$error":"#N/A"}},{"$f":"+Tariffe!$C$3*F13*$F$6","v":{"$error":"#N/A"}},null,null,null,null,{"$f":"+ROUND((G13+H13+I13),2)","v":{"$error":"#N/A"}}]
[null,{"$f":"+C13","v":{"$error":"#N/A"}},{"$f":"VLOOKUP(F8,Fasce!A:C,3,FALSE)","v":{"$error":"#N/A"}},{"$f":"+E13","v":{"$error":"#N/A"}},{"$f":"+ROUND(C14/365*$F$4,0)","v":{"$error":"#N/A"}},{"$f":"+IF(F7>=E14,E14-E13,IF(F7>=E13,F7-E13,IF(F7<E13,0)))","v":{"$error":"#N/A"}},{"$f":"+Tariffe!$A$4*F14","v":{"$error":"#N/A"}},{"$f":"+Tariffe!$B$3*F14*$F$5","v":{"$error":"#N/A"}},{"$f":"+Tariffe!$C$3*F14*$F$6","v":{"$error":"#N/A"}},null,null,null,null,{"$f":"+ROUND((G14+H14+I14),2)","v":{"$error":"#N/A"}}]
[null,{"$f":"+C14","v":{"$error":"#N/A"}},{"$f":"VLOOKUP(F8,Fasce!A:D,4,FALSE)","v":{"$error":"#N/A"}},{"$f":"+E14","v":{"$error":"#N/A"}},{"$f":"+ROUND(C15/365*$F$4,0)","v":{"$error":"#N/A"}},{"$f":"+IF(F7>=E15,E15-E14,IF(F7>=E14,F7-E14,IF(F7<E14,0)))","v":{"$error":"#N/A"}},{"$f":"+Tariffe!$A$5*F15","v":{"$error":"#N/A"}},{"$f":"+Tariffe!$B$3*F15*$F$5","v":{"$error":"#N/A"}},{"$f":"+Tariffe!$C$3*F15*$F$6","v":{"$error":"#N/A"}},null,null,null,null,{"$error":"#N/A"}]
[null,{"$f":"+C15","v":{"$error":"#N/A"}},{"$f":"VLOOKUP(F8,Fasce!A:E,5,FALSE)","v":{"$error":"#N/A"}},{"$f":"+E15","v":{"$error":"#N/A"}},{"$f":"+ROUND(C16/365*$F$4,0)","v":{"$error":"#N/A"}},{"$f":"+IF(F7>=E16,E16-E15,IF(F7>=E15,F7-E15,IF(F7<E15,0)))","v":{"$error":"#N/A"}},{"$f":"+Tariffe!$A$6*F16","v":{"$error":"#N/A"}},{"$f":"+Tariffe!$B$3*F16*$F$5","v":{"$error":"#N/A"}},{"$f":"+Tariffe!$C$3*F16*$F$6","v":{"$error":"#N/A"}},null,null,null,null,{"$error":"#N/A"}]
[null,{"$f":"+C16","v":{"$error":"#N/A"}},999999,{"$f":"+E16","v":{"$error":"#N/A"}},999999,{"$f":"+IF(F7>=E17,E17-E16,IF(F7>=E16,F7-E16,IF(F7<E16,0,F7-E16)))","v":{"$error":"#N/A"}},{"$f":"+Tariffe!$A$7*F17","v":{"$error":"#N/A"}},{"$f":"+Tariffe!$B$3*F17*$F$5","v":{"$error":"#N/A"}},{"$f":"+Tariffe!$C$3*F17*$F$6","v":{"$error":"#N/A"}},null,null,null,null,{"$error":"#N/A"}]
[null,null,null,null,null,null,null,null,null,{"$f":"+Tariffe!$E$3*DOMESTICO!$F$4/365","v":5.7424019178082188E-2},null,null,null,{"$f":"+ROUND(J18,2)","v":0.06}]
[null,null,null,null,null,null,null,null,null,null,{"$f":"+(Tariffe!$I$3+Tariffe!$J$3+Tariffe!$K$3+Tariffe!$L$3+Tariffe!$M$3)*DOMESTICO!F7","v":0},{"$f":"+(Tariffe!$I$3+Tariffe!$J$3+Tariffe!$K$3+Tariffe!$L$3+Tariffe!$M$3)*DOMESTICO!F7*F5","v":0},{"$f":"+(Tariffe!$I$3+Tariffe!$J$3+Tariffe!$K$3+Tariffe!$L$3)*DOMESTICO!F7*F6","v":0},{"$f":"+ROUND(K19+L19+M19,2)","v":0}]
[null,null,null,null,null,null,null,null,null,null,null,null,null,{"$f":"SUM(N13:N19)","v":{"$error":"#N/A"}},"Imponibile"]
[null,null,null,null,null,null,null,null,null,null,null,null,null,{"$f":"+ROUND(N20*0.1,2)","v":{"$error":"#N/A"}},"IVA (10%)"]
[null,null,null,null,null,null,null,null,null,null,null,null,null,{"$f":"SUM(N20:N21)","v":{"$error":"#N/A"}},"Totale corrispettivi"]

{"sheet":"DOMESTICO_NR","index":1,"n_rows":20,"n_cols":15,"rows_kept":20,"cut":false,"hidden":false,"merged":[[0,0,0,5],[8,0,8,8],[8,9,8,10],[9,0,19,0],[9,1,9,2],[9,3,9,4],[9,6,9,8],[9,10,9,12]]}
["Unità  domestico non residente",null,null,null,null,null,null,"Unità",1]
["Data inizio periodo consumo",null,null,null,null,{"$f":"Tabella_ripartizione!C1","v":"00:00:00"}]
["Data fine periodo consumo",null,null,null,null,{"$f":"Tabella_ripartizione!C2","v":"00:00:00"}]
["Giorni di consumo",null,null,null,null,{"$f":"+F3-F2+1","v":1}]
["Fognatura",null,null,null,null,{"$f":"Tabella_ripartizione!C4","v":1},"(0 = esente, 1=assoggettato)"]
["Depurazione",null,null,null,null,{"$f":"Tabella_ripartizione!C5","v":1},"(0 = esente, 1=assoggettato)"]
["Consumo misurato"]
[]
["Tariffe TICSI",null,null,null,null,null,null,null,null,2024]
["Domestico NON Residente","Fasce anno (m3)",null,"Fasce pro-die (m3)",null,"mc riarticolati","Importi servizio",null,null,"Importi Quota fissa","Importi perequazione"]
[null,"da","a","da","a",{"$f":"+F15+F14+F13+F12","v":0},"Acqua","Fogna","Depurazione","Acqua","Acqua","Fogna","Depurazione","Totali"]
[null,0,18,0,{"$f":"+ROUND(C12/365*$F$4,0)","v":0},{"$f":"+IF(F7>=E12,E12,F7)","v":0},{"$f":"+Tariffe!A18*F12","v":0},{"$f":"+Tariffe!$B$18*F12*$F$5","v":0},{"$f":"Tariffe!$C$18*F12*$F$6","v":0},null,null,null,null,{"$f":"+ROUND((G12+H12+I12),2)","v":0}]
[null,{"$f":"+C12","v":18},72,{"$f":"+E12","v":0},{"$f":"+ROUND(C13/365*$F$4,0)","v":0},{"$f":"+IF(F7>=E13,E13-E12,IF(F7>=E12,F7-E12,IF(F7<E12,0)))","v":0},{"$f":"+Tariffe!A19*F13","v":0},{"$f":"Tariffe!$B$18*F13*$F$5","v":0},{"$f":"Tariffe!$C$3*F13*$F$6","v":0},null,null,null,null,{"$f":"+ROUND((G13+H13+I13),2)","v":0}]
[null,{"$f":"+C13","v":72},99999,{"$f":"+E13","v":0},99999,{"$f":"+IF(F7>=E14,E14-E13,IF(F7>=E13,F7-E13,IF(F7<E13,0)))","v":0},{"$f":"Tariffe!A20*F14","v":0},{"$f":"Tariffe!$B$18*F14*$F$5","v":0},{"$f":"Tariffe!$C$3*F14*$F$6","v":0},null,null,null,null,{"$f":"+ROUND((G14+H14+I14),2)","v":0}]
[null,0,0,0,0,0,0,0,0,null,null,null,null,{"$f":"+ROUND((G15+H15+I15),2)","v":0}]
[null,null,null,null,null,null,null,null,null,{"$f":"+Tariffe!$E$3*DOMESTICO_NR!$F$4/365","v":5.7424019178082188E-2},null,null,null,{"$f":"+ROUND(J16,2)","v":0.06}]
[null,null,null,null,null,null,null,null,null,null,{"$f":"(+Tariffe!$I$3+Tariffe!$J$3+Tariffe!$K$3+Tariffe!$L$3+Tariffe!$M$3)*DOMESTICO_NR!F7","v":0},{"$f":"(+Tariffe!$I$3+Tariffe!$J$3+Tariffe!$K$3+Tariffe!$L$3+Tariffe!$M$3)*DOMESTICO_NR!F7","v":0},{"$f":"COMMERCIALE!K18=(+Tariffe!$I$3+Tariffe!$J$3+Tariffe!$K$3+Tariffe!$L$3+Tariffe!$M$3)*DOMESTICO_NR!F7","v":true},{"$f":"+ROUND(K17+L17+M17,2)","v":1}]
[null,null,null,null,null,null,null,null,null,null,null,null,null,{"$f":"SUM(N12:N17)","v":1.06},"Imponibile"]
[null,null,null,null,null,null,null,null,null,null,null,null,null,{"$f":"+ROUND(N18*0.1,2)","v":0.11},"IVA (10%)"]
[null,null,null,null,null,null,null,null,null,null,null,null,null,{"$f":"+N19+N18","v":1.1700000000000002},"Totale corrispettivi"]

{"sheet":"COMMERCIALE","index":2,"n_rows":21,"n_cols":15,"rows_kept":21,"cut":false,"hidden":false,"merged":[[0,0,0,5],[8,0,8,8],[8,9,8,10],[9,0,20,0],[9,1,9,2],[9,3,9,4],[9,6,9,8],[9,10,9,12]]}
["Unità  commerciale",null,null,null,null,null,null,"Unità",1]
["Data inizio periodo consumo",null,null,null,null,{"$f":"Tabella_ripartizione!C1","v":"00:00:00"}]
["Data fine periodo consumo",null,null,null,null,{"$f":"Tabella_ripartizione!C2","v":"00:00:00"}]
["Giorni di consumo",null,null,null,null,{"$f":"+F3-F2+1","v":1}]
["Fognatura",null,null,null,null,{"$f":"Tabella_ripartizione!C4","v":1},"(0 = esente, 1=assoggettato)"]
["Depurazione",null,null,null,null,{"$f":"Tabella_ripartizione!C5","v":1},"(0 = esente, 1=assoggettato)"]
["Consumo misurato"]
[]
["Tariffe TICSI",null,null,null,null,null,null,null,null,2024]
["Commerciale artigianale","Fasce anno (m3)",null,"Fasce pro-die (m3)",null,"mc riarticolati","Importi servizio",null,null,"Importi Quota fissa","Importi perequazione"]
[null,"da","a","da","a",{"$f":"+F15+F14+F13+F12","v":0},"Acqua","Fogna","Depurazione","Acqua","Acqua","Fogna","Depurazione","Totali"]
[null,0,72,0,{"$f":"+ROUND(C12/365*$F$4,0)","v":0},{"$f":"+IF(F7>=E12,E12,F7)","v":0},{"$f":"+Tariffe!A11*F12","v":0},{"$f":"+Tariffe!$B11*F12*$F$5","v":0},{"$f":"+Tariffe!$C11*F12*$F$6","v":0},null,null,null,null,{"$f":"+ROUND((G12+H12+I12),2)","v":0}]
[null,72,108,{"$f":"+E12","v":0},{"$f":"+ROUND(C13/365*$F$4,0)","v":0},{"$f":"+IF(F7>=E13,E13-E12,IF(F7>=E12,F7-E12,IF(F7<E12,0)))","v":0},{"$f":"+Tariffe!A12*F13","v":0},{"$f":"+Tariffe!$B12*F13*$F$5","v":0},{"$f":"+Tariffe!$C12*F13*$F$6","v":0},null,null,null,null,{"$f":"+ROUND((G13+H13+I13),2)","v":0}]
[null,108,144,{"$f":"E13","v":0},{"$f":"+ROUND(C14/365*$F$4,0)","v":0},{"$f":"+IF(F7>=E14,E14-E13,IF(F7>=E13,F7-E13,IF(F7<E13,0)))","v":0},{"$f":"+Tariffe!A13*F14","v":0},{"$f":"+Tariffe!$B13*F14*$F$5","v":0},{"$f":"+Tariffe!$C13*F14*$F$6","v":0},null,null,null,null,0]
[null,{"$f":"+C14","v":144},180,{"$f":"E14","v":0},{"$f":"+ROUND(C15/365*$F$4,0)","v":0},{"$f":"+IF(F7>=E15,E15-E14,IF(F7>=E14,F7-E14,IF(F7<E14,0)))","v":0},{"$f":"+Tariffe!A14*F15","v":0},{"$f":"+Tariffe!$B14*F15*$F$5","v":0},{"$f":"+Tariffe!$C14*F15*$F$6","v":0},null,null,null,null,0]
[null,{"$f":"+C15","v":180},99999,{"$f":"+E15","v":0},99999,{"$f":"+IF(F7>=E16,E16-E15,IF(F7>=E15,F7-E15,IF(F7<E13,0)))","v":0},{"$f":"+Tariffe!A15*F16","v":0},{"$f":"+Tariffe!$B15*F16*$F$5","v":0},{"$f":"+Tariffe!$C15*F16*$F$6","v":0},null,null,null,null,0]
[null,null,null,null,null,null,null,null,null,{"$f":"+Tariffe!E11*COMMERCIALE!$F$4/365","v":9.789065753424657E-2},null,null,null,{"$f":"+ROUND(J17,2)","v":0.1}]
[null,null,null,null,null,null,null,null,null,null,{"$f":"(+Tariffe!$I$3+Tariffe!$J$3+Tariffe!$K$3+Tariffe!$L$3+Tariffe!$M$3)*COMMERCIALE!F7","v":0},{"$f":"(+Tariffe!$I$3+Tariffe!$J$3+Tariffe!$K$3+Tariffe!$L$3+Tariffe!$M$3)*COMMERCIALE!F7","v":0},{"$f":"(+Tariffe!$I$3+Tariffe!$J$3+Tariffe!$K$3+Tariffe!$L$3+Tariffe!$M$3)*COMMERCIALE!F7","v":0},{"$f":"+ROUND(K18+L18+M18,2)","v":0}]
[null,null,null,null,null,null,null,null,null,null,null,null,null,{"$f":"SUM(N12:N18)","v":0.1},"Imponibile"]
[null,null,null,null,null,null,null,null,null,null,null,null,null,{"$f":"+ROUND(N19*0.1,2)","v":0.01},"IVA (10%)"]
[null,null,null,null,null,null,null,null,null,null,null,null,null,{"$f":"+N20+N19","v":0.11},"Totale corrispettivi"]

{"sheet":"ALTRI_USI","index":3,"n_rows":21,"n_cols":15,"rows_kept":21,"cut":false,"hidden":false,"merged":[[0,0,0,5],[8,0,8,8],[8,9,8,10],[9,0,20,0],[9,1,9,2],[9,3,9,4],[9,6,9,8],[9,10,9,12]]}
["Unità altri usi",null,null,null,null,null,null,"Unità",1]
["Unità immobiliare - altri usi",null,null,null,null,{"$f":"Tabella_ripartizione!C1","v":"00:00:00"}]
["Data fine periodo consumo",null,null,null,null,{"$f":"Tabella_ripartizione!C2","v":"00:00:00"}]
["Giorni di consumo",null,null,null,null,{"$f":"+F3-F2+1","v":1}]
["Fognatura",null,null,null,null,{"$f":"Tabella_ripartizione!C4","v":1},"(0 = esente, 1=assoggettato)"]
["Depurazione",null,null,null,null,{"$f":"Tabella_ripartizione!C5","v":1},"(0 = esente, 1=assoggettato)"]
["Consumo misurato"]
[]
["Tariffe TICSI",null,null,null,null,null,null,null,null,2024]
["Commerciale artigianale","Fasce anno (m3)",null,"Fasce pro-die (m3)",null,"mc riarticolati","Importi servizio",null,null,"Importi Quota fissa","Importi perequazione"]
[null,"da","a","da","a",{"$f":"+F15+F14+F13+F12","v":0},"Acqua","Fogna","Depurazione","Acqua","Acqua","Fogna","Depurazione","Totali"]
[null,0,144,0,{"$f":"+ROUND(C12/365*$F$4,0)","v":0},{"$f":"+IF(F7>=E12,E12,F7)","v":0},{"$f":"+Tariffe!A11*F12","v":0},{"$f":"+Tariffe!$B11*F12*$F$5","v":0},{"$f":"+Tariffe!$C11*F12*$F$6","v":0},null,null,null,null,{"$f":"+ROUND((G12+H12+I12),2)","v":0}]
[null,145,180,{"$f":"+E12","v":0},{"$f":"+ROUND(C13/365*$F$4,0)","v":0},{"$f":"+IF(F7>=E13,E13-E12,IF(F7>=E12,F7-E12,IF(F7<E12,0)))","v":0},{"$f":"+Tariffe!A12*F13","v":0},{"$f":"+Tariffe!$B12*F13*$F$5","v":0},{"$f":"+Tariffe!$C12*F13*$F$6","v":0},null,null,null,null,{"$f":"+ROUND((G13+H13+I13),2)","v":0}]
[null,181,216,{"$f":"E13","v":0},{"$f":"+ROUND(C14/365*$F$4,0)","v":1},{"$f":"+IF(F7>=E14,E14-E13,IF(F7>=E13,F7-E13,IF(F7<E13,0)))","v":0},{"$f":"+Tariffe!A13*F14","v":0},{"$f":"+Tariffe!$B13*F14*$F$5","v":0},{"$f":"+Tariffe!$C13*F14*$F$6","v":0},null,null,null,null,0]
[null,216,252,{"$f":"E14","v":1},{"$f":"+ROUND(C15/365*$F$4,0)","v":1},{"$f":"+IF(F7>=E15,E15-E14,IF(F7>=E14,F7-E14,IF(F7<E14,0)))","v":0},{"$f":"+Tariffe!A14*F15","v":0},{"$f":"+Tariffe!$B14*F15*$F$5","v":0},{"$f":"+Tariffe!$C14*F15*$F$6","v":0},null,null,null,null,0]
[null,{"$f":"+C15","v":252},99999,{"$f":"+E15","v":1},99999,{"$f":"+IF(F7>=E16,E16-E15,IF(F7>=E15,F7-E15,IF(F7<E13,0)))","v":false},{"$f":"+Tariffe!A15*F16","v":0},{"$f":"+Tariffe!$B15*F16*$F$5","v":0},{"$f":"+Tariffe!$C15*F16*$F$6","v":0},null,null,null,null,0]
[null,null,null,null,null,null,null,null,null,{"$f":"+Tariffe!E11*ALTRI_USI!$F$4/365","v":9.789065753424657E-2},null,null,null,{"$f":"+ROUND(J17,2)","v":0.1}]
[null,null,null,null,null,null,null,null,null,null,{"$f":"(+Tariffe!$I$3+Tariffe!$J$3+Tariffe!$K$3+Tariffe!$L$3+Tariffe!$M$3)*ALTRI_USI!F7","v":0},{"$f":"(+Tariffe!$I$3+Tariffe!$J$3+Tariffe!$K$3+Tariffe!$L$3+Tariffe!$M$3)*ALTRI_USI!F7","v":0},{"$f":"(+Tariffe!$I$3+Tariffe!$J$3+Tariffe!$K$3+Tariffe!$L$3+Tariffe!$M$3)*ALTRI_USI!F7","v":0},{"$f":"+ROUND(K18+L18+M18,2)","v":0}]
[null,null,null,null,null,null,null,null,null,null,null,null,null,{"$f":"SUM(N12:N18)","v":0.1},"Imponibile"]
[null,null,null,null,null,null,null,null,null,null,null,null,null,{"$f":"+ROUND(N19*0.1,2)","v":0.01},"IVA (10%)"]
[null,null,null,null,null,null,null,null,null,null,null,null,null,{"$f":"+N20+N19","v":0.11},"Totale corrispettivi"]

{"sheet":"Tariffe","index":4,"n_rows":20,"n_cols":12,"rows_kept":20,"cut":false,"hidden":false,"merged":[]}
["importi consumo uso domesico",null,null,null,"importi quota fissa uso domesico",null,null,null,"importi perequazione"]
["acqua ","fognatura","depurazione",null,"acqua ",null,null,null,"UI1","UI2","UI3","UI4"]
[0.56884000000000001,0.106546,0.76268000000000002,null,20.959766999999999,null,null,null,4.0000000000000001E-3,8.9999999999999993E-3,1.7899999999999999E-2,0]
[1.0041150000000001,0.106546,0.76268000000000002]
[1.296532,0.106546,0.76268000000000002]
[1.7329079999999999,0.106546,0.76268000000000002]
[2.2187709999999998,0.106546,0.76268000000000002]
[]
["import i uso artigianale e commerciale",null,null,null,"importi quota fissa uso non domesico"]
["acqua","fognatura","depurazione",null,"acqua "]
[1.214656,0.106546,0.76268000000000002,null,35.730089999999997]
[1.61954,0.106546,0.76268000000000002]
[2.1054029999999999,0.106546,0.76268000000000002]
[2.5912649999999999,0.106546,0.76268000000000002]
[2.6722419999999998,0.106546,0.76268000000000002]
["importi consumo uso domesico non residente"]
["acqua ","fognatura","depurazione"]
[1.0041150000000001,0.106546,0.76268000000000002]
[1.7329079999999999,0.106546,0.76268000000000002]
[2.2187709999999998,0.106546,0.76268000000000002]

{"sheet":"Fasce","index":5,"n_rows":11,"n_cols":5,"rows_kept":11,"cut":false,"hidden":false,"merged":[]}
["componente","fascia_1","fascia_2","fascia_3","fascia_4"]
[1,24,48,72,96]
[2,{"$f":"B2*A3","v":48},{"$f":"C2*A3","v":96},{"$f":"D2*A3","v":144},{"$f":"E2*A3","v":192}]
[3,{"$f":"B2*A4","v":72},{"$f":"C2*A4","v":144},{"$f":"D2*A4","v":216},{"$f":"E2*A4","v":288}]
[4,{"$f":"B2*A5","v":96},{"$f":"C2*A5","v":192},{"$f":"D2*A5","v":288},{"$f":"E2*A5","v":384}]
[5,{"$f":"B5+24","v":120},{"$f":"C5+C2","v":240},360,{"$f":"E5+96","v":480}]
[6,144,288,432,576]
[7,168,336,504,672]
[8,192,384,576,768]
[9,216,432,648,864]
[10,240,480,720,960]

{"sheet":"Tabella_ripartizione","index":6,"n_rows":171,"n_cols":7,"rows_kept":171,"cut":false,"hidden":false,"merged":[]}
[null,"Data inizio periodo consumo"]
[null,"Data fine periodo consumo"]
[null,"Giorni di consumo",{"$f":"+C2-C1+1","v":1}]
[null,"Fognatura",1,"(0 = esente, 1=assoggettato)"]
[null,"Depurazione",1,"(0 = esente, 1=assoggettato)"]
[]
[null,"Totale bolletta",null,null,"Totale quota diretta","Totale delta","Totale ripartizione"]
[null,"delta da ripartire",{"$f":"+C7-E8","v":0},null,{"$f":"SUM(E12:E65507)","v":0},{"$f":"SUM(F12:F65507)","v":{"$error":"#DIV/0!"}},{"$f":"SUM(G12:G171)","v":{"$error":"#DIV/0!"}}]
[]
[]
[null,"Tabella consumi e residenti","Consumo","Residenti","Quota diretta","Riparto delta","Totale ripartito"]
[null,"Unità domestica residente #1",null,null,null,{"$f":"+ROUND(E12/$E$8*$C$8,2)","v":{"$error":"#DIV/0!"}},{"$f":"SUM(E12:F12)","v":{"$error":"#DIV/0!"}}]
[null,"Unità domestica residente #2",null,null,null,{"$f":"+ROUNDDOWN(E13/$E$8*$C$8,2)","v":{"$error":"#DIV/0!"}},{"$f":"SUM(E13:F13)","v":{"$error":"#DIV/0!"}}]
[null,"Unità domestica residente #3",null,null,null,{"$error":"#DIV/0!"},{"$error":"#DIV/0!"}]
[null,"Unità domestica residente #4",null,null,null,{"$error":"#DIV/0!"},{"$error":"#DIV/0!"}]
[null,"Unità domestica residente #5",null,null,null,{"$error":"#DIV/0!"},{"$error":"#DIV/0!"}]
[null,"Unità domestica residente #6",null,null,null,{"$error":"#DIV/0!"},{"$error":"#DIV/0!"}]
[null,"Unità domestica residente #7",null,null,null,{"$error":"#DIV/0!"},{"$error":"#DIV/0!"}]
[null,"Unità domestica residente #8",null,null,null,{"$error":"#DIV/0!"},{"$error":"#DIV/0!"}]
[null,"Unità domestica residente #9",null,null,null,{"$error":"#DIV/0!"},{"$error":"#DIV/0!"}]
[null,"Unità domestica residente #10",null,null,null,{"$error":"#DIV/0!"},{"$error":"#DIV/0!"}]
[null,"Unità domestica residente #11",null,null,null,{"$error":"#DIV/0!"},{"$error":"#DIV/0!"}]
[null,"Unità domestica residente #12",null,null,null,{"$error":"#DIV/0!"},{"$error":"#DIV/0!"}]
[null,"Unità domestica residente #13",null,null,null,{"$error":"#DIV/0!"},{"$error":"#DIV/0!"}]
[null,"Unità domestica residente #14",null,null,null,{"$error":"#DIV/0!"},{"$error":"#DIV/0!"}]
[null,"Unità domestica residente #15",null,null,null,{"$error":"#DIV/0!"},{"$error":"#DIV/0!"}]
[null,"Unità domestica residente #16",null,null,null,{"$error":"#DIV/0!"},{"$error":"#DIV/0!"}]
[null,"Unità domestica residente #17",null,null,null,{"$error":"#DIV/0!"},{"$error":"#DIV/0!"}]
[null,"Unità domestica residente #18",null,null,null,{"$error":"#DIV/0!"},{"$error":"#DIV/0!"}]
[null,"Unità domestica residente #19",null,null,null,{"$error":"#DIV/0!"},{"$error":"#DIV/0!"}]
[null,"Unità domestica residente #20",null,null,null,{"$error":"#DIV/0!"},{"$error":"#DIV/0!"}]
[null,"Unità domestica residente #21",null,null,null,{"$error":"#DIV/0!"},{"$error":"#DIV/0!"}]
[null,"Unità domestica residente #22",null,null,null,{"$error":"#DIV/0!"},{"$error":"#DIV/0!"}]
[null,"Unità domestica residente #23",null,null,null,{"$error":"#DIV/0!"},{"$error":"#DIV/0!"}]
[null,"Unità domestica residente #24",null,null,null,{"$error":"#DIV/0!"},{"$error":"#DIV/0!"}]
[null,"Unità domestica residente #25",null,null,null,{"$error":"#DIV/0!"},{"$error":"#DIV/0!"}]
[null,"Unità domestica residente #26",null,null,null,{"$error":"#DIV/0!"},{"$error":"#DIV/0!"}]
[null,"Unità domestica residente #27",null,null,null,{"$error":"#DIV/0!"},{"$error":"#DIV/0!"}]
[null,"Unità domestica residente #28",null,null,null,{"$error":"#DIV/0!"},{"$error":"#DIV/0!"}]
[null,"Unità domestica residente #29",null,null,null,{"$error":"#DIV/0!"},{"$error":"#DIV/0!"}]
[null,"Unità domestica residente #30",null,null,null,{"$error":"#DIV/0!"},{"$error":"#DIV/0!"}]
[null,"Unità domestica residente #31",null,null,null,{"$error":"#DIV/0!"},{"$error":"#DIV/0!"}]
[null,"Unità domestica residente #32",null,null,null,{"$error":"#DIV/0!"},{"$error":"#DIV/0!"}]
[null,"Unità domestica residente #33",null,null,null,{"$error":"#DIV/0!"},{"$f":"SUM(E44:F44)","v":{"$error":"#DIV/0!"}}]
[null,"Unità domestica residente #34",null,null,null,{"$error":"#DIV/0!"},{"$error":"#DIV/0!"}]
[null,"Unità domestica residente #35",null,null,null,{"$error":"#DIV/0!"},{"$error":"#DIV/0!"}]
[null,"Unità domestica residente #36",null,null,null,{"$error":"#DIV/0!"},{"$error":"#DIV/0!"}]
[null,"Unità domestica residente #37",null,null,null,{"$error":"#DIV/0!"},{"$error":"#DIV/0!"}]
[null,"Unità domestica residente #38",null,null,null,{"$error":"#DIV/0!"},{"$error":"#DIV/0!"}]
[null,"Unità domestica residente #39",null,null,null,{"$error":"#DIV/0!"},{"$error":"#DIV/0!"}]
[null,"Unità domestica residente #40",null,null,null,{"$error":"#DIV/0!"},{"$error":"#DIV/0!"}]
[null,"Unità domestica residente #41",null,null,null,{"$error":"#DIV/0!"},{"$error":"#DIV/0!"}]
[null,"Unità domestica residente #42",null,null,null,{"$error":"#DIV/0!"},{"$error":"#DIV/0!"}]
[null,"Unità domestica residente #43",null,null,null,{"$error":"#DIV/0!"},{"$error":"#DIV/0!"}]
[null,"Unità domestica residente #44",null,null,null,{"$error":"#DIV/0!"},{"$error":"#DIV/0!"}]
[null,"Unità domestica residente #45",null,null,null,{"$error":"#DIV/0!"},{"$error":"#DIV/0!"}]
[null,"Unità domestica residente #46",null,null,null,{"$error":"#DIV/0!"},{"$error":"#DIV/0!"}]
[null,"Unità domestica residente #47",null,null,null,{"$error":"#DIV/0!"},{"$error":"#DIV/0!"}]
[null,"Unità domestica residente #48",null,null,null,{"$error":"#DIV/0!"},{"$error":"#DIV/0!"}]
[null,"Unità domestica residente #49",null,null,null,{"$error":"#DIV/0!"},{"$error":"#DIV/0!"}]
[null,"Unità domestica residente #50",null,null,null,{"$error":"#DIV/0!"},{"$error":"#DIV/0!"}]
[null,"Unità domestica residente #51",null,null,null,{"$error":"#DIV/0!"},{"$error":"#DIV/0!"}]
[null,"Unità domestica residente #52",null,null,null,{"$error":"#DIV/0!"},{"$error":"#DIV/0!"}]
[null,"Unità domestica residente #53",null,null,null,{"$error":"#DIV/0!"},{"$error":"#DIV/0!"}]
[null,"Unità domestica residente #54",null,null,null,{"$error":"#DIV/0!"},{"$error":"#DIV/0!"}]
[null,"Unità domestica residente #55",null,null,null,{"$error":"#DIV/0!"},{"$error":"#DIV/0!"}]
[null,"Unità domestica residente #56",null,null,null,{"$error":"#DIV/0!"},{"$error":"#DIV/0!"}]
[null,"Unità domestica residente #57",null,null,null,{"$error":"#DIV/0!"},{"$error":"#DIV/0!"}]
[null,"Unità domestica residente #58",null,null,null,{"$error":"#DIV/0!"},{"$error":"#DIV/0!"}]
[null,"Unità domestica residente #59",null,null,null,{"$error":"#DIV/0!"},{"$error":"#DIV/0!"}]
[null,"Unità domestica residente #60",null,null,null,{"$error":"#DIV/0!"},{"$error":"#DIV/0!"}]
[null,"Unità domestica residente #61",null,null,null,{"$error":"#DIV/0!"},{"$error":"#DIV/0!"}]
[null,"Unità domestica residente #62",null,null,null,{"$error":"#DIV/0!"},{"$error":"#DIV/0!"}]
[null,"Unità domestica residente #63",null,null,null,{"$error":"#DIV/0!"},{"$error":"#DIV/0!"}]
[null,"Unità domestica residente #64",null,null,null,{"$error":"#DIV/0!"},{"$error":"#DIV/0!"}]
[null,"Unità domestica residente #65",null,null,null,{"$error":"#DIV/0!"},{"$error":"#DIV/0!"}]
[null,"Unità domestica residente #66",null,null,null,{"$f":"+ROUNDDOWN(E77/$E$8*$C$8,2)","v":{"$error":"#DIV/0!"}},{"$error":"#DIV/0!"}]
[null,"Unità domestica residente #67",null,null,null,{"$error":"#DIV/0!"},{"$error":"#DIV/0!"}]
[null,"Unità domestica residente #68",null,null,null,{"$error":"#DIV/0!"},{"$error":"#DIV/0!"}]
[null,"Unità domestica residente #69",null,null,null,{"$error":"#DIV/0!"},{"$error":"#DIV/0!"}]
{"$rows_left_out":91}